*Heading
** Job name: thermoMecaTransient Model name: Model-1-Transient
** Generated by: Abaqus/CAE Version 6.8-2
*Preprint, echo=NO, model=NO, history=NO, contact=NO
**
** PARTS
**
*Part, name=Part-1
*Node
*Element, type=C3D20RT
*Nset, nset=_PickedSet25, internal, generate
*Elset, elset=_PickedSet25, internal, generate
** Section: steelSection
*Solid Section, elset=_PickedSet25, material=steel
*End Part
**
**
** ASSEMBLY
**
*Assembly, name=Assembly
**
*Instance, name=Part-1-1, part=Part-1
*End Instance
**
*Nset, nset=_PickedSet11, internal, instance=Part-1-1
*Elset, elset=_PickedSet11, internal, instance=Part-1-1
*Nset, nset=_PickedSet12, internal, instance=Part-1-1
*Elset, elset=_PickedSet12, internal, instance=Part-1-1
*Nset, nset=_PickedSet13, internal, instance=Part-1-1, generate
*Elset, elset=_PickedSet13, internal, instance=Part-1-1, generate
*Nset, nset=Set-1, instance=Part-1-1, generate
*Elset, elset=__PickedSurf10_S2, internal, instance=Part-1-1
*Elset, elset=__PickedSurf10_S4, internal, instance=Part-1-1
*Elset, elset=__PickedSurf10_S1, internal, instance=Part-1-1
*Elset, elset=__PickedSurf10_S5, internal, instance=Part-1-1
*Elset, elset=__PickedSurf10_S6, internal, instance=Part-1-1
*Surface, type=ELEMENT, name=_PickedSurf10, internal
__PickedSurf10_S2, S2
__PickedSurf10_S4, S4
__PickedSurf10_S6, S6
__PickedSurf10_S1, S1
__PickedSurf10_S5, S5
*End Assembly
**
** MATERIALS
**
*Material, name=steel
*Conductivity
30.,
*Density
 7.8e-09,
*Elastic
210000., 0.3
*Expansion
 1e-05,
*Specific Heat
 1e+09,
**
** PREDEFINED FIELDS
**
** Name: initTemp   Type: Temperature
*Initial Conditions, type=TEMPERATURE
_PickedSet13, 25.
** ----------------------------------------------------------------
**
** STEP: thermomeca
**
*Step, name=thermomeca, inc=1000
*Coupled Temperature-Displacement, creep=none, deltmx=2.
1., 2000., 0.02, 2000.
**
** BOUNDARY CONDITIONS
**
** Name: encastr Type: Displacement/Rotation
*Boundary
_PickedSet12, 1, 1
_PickedSet12, 2, 2
_PickedSet12, 3, 3
** Name: extTemp Type: Temperature
*Boundary
_PickedSet11, 11, 11, 25.
**
** LOADS
**
** Name: heatFlux   Type: Surface heat flux
*Dsflux
_PickedSurf10, S, 1.98944
**
** OUTPUT REQUESTS
**
*Restart, write, frequency=0
**
** FIELD OUTPUT: F-Output-1
**
*Output, field
*Node Output
CF, NT, RF, RFL, U
*Element Output, directions=YES
HFL, LE, NFLUX, NFORC, PE, PEEQ, PEMAG, S
*Contact Output
CDISP, CSTRESS, HFLA
**
** HISTORY OUTPUT: H-Output-2
**
*Output, history
*Node Output, nset=Set-1
NT,
**
** HISTORY OUTPUT: H-Output-1
**
*Output, history, variable=PRESELECT
*End Step