** **************************************************************
**  Abaqus  6.14-1
********
*HEADING
Bending of cantilever beam: verification of elastic distorsion
beam: section 10x20 mm2, length 200 mm, load : 100 kPa
*SYSTEM
***** units: mm, N, kg, s, MPa
*node
*ngen,nset=nn0
***** dx = 20 mm/8 = 2.25 mm et dy = 10/4 = 2.5 mm
*ngen,nset=nn1
**** section in xy plane
*nfill,nset=n0
nn0,nn1,4,10
****
*ncopy,change number=10000,old set=n0, new set=n100,shift
*nfill,nset=nall,bias=1.
n0,n100,100,100
******************************
*element,type=c3d8
****
*elgen,elset=eall
********************************
*elset,elset=etop,generate
*elset,elset=e100mm,generate
*Surface, type=ELEMENT, name=top
etop, S5
*nset,nset=nmes,generate
*elset,elset=emes
*nset,nset=nfix,generate
*******
*SOLID SECTION, ELSET=eall, MATERIAL=alu
****
*MATERIAL,NAME=alu
*elastic
75.e3,0.3
*density
***** en kg/mm3
2.7e-6
***************************************************
*************
************************
*STEP,name=loading 10 MPa,nlgeom=yes
elastic beam (fine mesh) under 0.1 MPa
******
*static
****dt0, step time, min, max
0.1,1.,1.e-5,1.
**************************
*boundary
**** fixed nodes
n0,encastre
*** nfix,encastre
*dsload
***** 100 kPa = 0.1 MPa
top,p,0.1
********* include gravity
*dload
xxxxxxxxx
******
****************************
*el print,position=centroidal,elset=emes,freq=100
mises,s11,s22,s33
*node print,nset=nmes,freq=10
coord,u1,u2,u3
************************************************
*OUTPUT,FIELD,freq=1,var=preselect
*output,history,freq=1,var=preselect
************************************
*monitor,node=10001,dof=2
*END STEP
*************